{"text_format":"1","workbook":"xlsx","n_sheets":5,"sheets":["Control","rules","|","schedule","hours"],"not_rendered":{"charts":0,"images":3,"macros":1,"external_links":0,"defined_names":25,"comments":0,"pivot_tables":0},"unopened":[],"bounds":{"document_bytes":16777216,"sheet_cells":100000,"rows_first":2000,"rows_last":500,"rows_between":2000,"halvings":0,"cell_chars":16384,"cell_head_chars":4096},"cells_cut":0,"cells_raw":0,"read":"whole","date_system":"1900"}

{"sheet":"Control","index":0,"n_rows":34,"n_cols":21,"rows_kept":34,"cut":false,"hidden":false,"merged":[[25,5,25,10],[0,4,0,10],[9,5,9,10],[10,5,10,10],[11,5,11,10],[12,5,12,10],[22,5,22,10],[23,5,23,10],[24,5,24,10],[26,5,26,10],[6,2,16,2],[13,5,13,10],[14,5,14,10],[15,5,15,10],[16,5,16,10],[17,5,17,10],[18,5,18,10],[19,5,19,10],[20,5,20,10],[21,5,21,10]]}
[null,"Date",{"$f":"NOW()","v":"2020-09-19T21:10:45.910"},null,{"$f":"TEXT(E3,\"MMMM\")","v":"September"}]
[null,"io","in",null,{"$f":"TEXT(E3,\"ddd\")","v":"Tue"},"Wed","Thu","Fri","Sat","Sun","Mon",null,"Date","wave","#","glyph","To-Do","Personal","Professional","Other"]
[null,"name","Caleb",null,{"$f":"M3","v":"2020-09-01"},{"$f":"E3+1","v":"2020-09-02"},"2020-09-03","2020-09-04","2020-09-05","2020-09-06","2020-09-07",null,"2020-09-01",{"$f":"IFERROR(INDEX(tzolkinGlyphs,MATCH((ROUND(IF(((ROUND(1+(20*(((M3-tzolkinStartDate)/20)-(ROUNDDOWN((M3-tzolkinStartDate)/20,0)))),0))-(IF(((((ROUNDDOWN(M3-tzolkinStartDate,0)+1)/13)-ROUNDDOWN((ROUNDDOWN(M3-tzolkinStartDate,0)+1)/13,0))*13)>0,((((ROUNDDOWN(M3-tzolkinStartDate,0)+1)/13)-ROUNDDOWN((ROUNDDOWN(M3-tzolkinStartDate,0)+1)/13,0))*13),13)))<0,20+((ROUND(1+(20*(((M3-tzolkinStartDate)/20)-(ROUNDDOWN((M3-tzolkinStartDate)/20,0)))),0))-(IF(((((ROUNDDOWN(M3-tzolkinStartDate,0)+1)/13)-ROUNDDOWN((ROUNDDOWN(M3-tzolkinStartDate,0)+1)/13,0))*13)>0,((((ROUNDDOWN(M3-tzolkinStartDate,0)+1)/13)-ROUNDDOWN((ROUNDDOWN(M3-tzolkinStartDate,0)+1)/13,0))*13),13))),((ROUND(1+(20*(((M3-tzolkinStartDate)/20)-(ROUNDDOWN((M3-tzolkinStartDate)/20,0)))),0))-(IF(((((ROUNDDOWN(M3-tzolkinStartDate,0)+1)/13)-ROUNDDOWN((ROUNDDOWN(M3-tzolkinStartDate,0)+1)/13,0))*13)>0,((((ROUNDDOWN(M3-tzolkinStartDate,0)+1)/13)-ROUNDDOWN((ROUNDDOWN(M3-tzolkinStartDate,0)+1)/13,0))*13),13)))),0)+1),glyphPosition,0)),\"Manik\")","v":"Chicchan"},{"$f":"(IF(((((ROUNDDOWN(M3-tzolkinStartDate,0)+1)/13)-ROUNDDOWN((ROUNDDOWN(M3-tzolkinStartDate,0)+1)/13,0))*13)>0,((((ROUNDDOWN(M3-tzolkinStartDate,0)+1)/13)-ROUNDDOWN((ROUNDDOWN(M3-tzolkinStartDate,0)+1)/13,0))*13),13))","v":7.0000000000000213},{"$f":"INDEX(tzolkinGlyphs,MATCH(ROUND((((((M3-tzolkinStartDate)/20)-(ROUNDDOWN((M3-tzolkinStartDate)/20,0)))*20)+1),0),glyphPosition,0))","v":"Chuen"},null,{"$f":"INDEX(schedule!$C:$C,MATCH(1,($M3=schedule!$A:$A)*(R$2=schedule!$B:$B),0))","v":{"$error":"#N/A"}},{"$f":"INDEX(schedule!$C:$C,MATCH(1,($M3=schedule!$A:$A)*(S$2=schedule!$B:$B),0))","v":{"$error":"#N/A"}},{"$f":"INDEX(schedule!$C:$C,MATCH(1,($M3=schedule!$A:$A)*(T$2=schedule!$B:$B),0))","v":{"$error":"#N/A"}}]
[null,"focus","Personal",null,{"$f":"E3+7","v":"2020-09-08"},"2020-09-09","2020-09-10","2020-09-11","2020-09-12","2020-09-13","2020-09-14",null,{"$f":"M3+1","v":"2020-09-02"},{"$f":"IFERROR(INDEX(tzolkinGlyphs,MATCH((ROUND(IF(((ROUND(1+(20*(((M4-tzolkinStartDate)/20)-(ROUNDDOWN((M4-tzolkinStartDate)/20,0)))),0))-(IF(((((ROUNDDOWN(M4-tzolkinStartDate,0)+1)/13)-ROUNDDOWN((ROUNDDOWN(M4-tzolkinStartDate,0)+1)/13,0))*13)>0,((((ROUNDDOWN(M4-tzolkinStartDate,0)+1)/13)-ROUNDDOWN((ROUNDDOWN(M4-tzolkinStartDate,0)+1)/13,0))*13),13)))<0,20+((ROUND(1+(20*(((M4-tzolkinStartDate)/20)-(ROUNDDOWN((M4-tzolkinStartDate)/20,0)))),0))-(IF(((((ROUNDDOWN(M4-tzolkinStartDate,0)+1)/13)-ROUNDDOWN((ROUNDDOWN(M4-tzolkinStartDate,0)+1)/13,0))*13)>0,((((ROUNDDOWN(M4-tzolkinStartDate,0)+1)/13)-ROUNDDOWN((ROUNDDOWN(M4-tzolkinStartDate,0)+1)/13,0))*13),13))),((ROUND(1+(20*(((M4-tzolkinStartDate)/20)-(ROUNDDOWN((M4-tzolkinStartDate)/20,0)))),0))-(IF(((((ROUNDDOWN(M4-tzolkinStartDate,0)+1)/13)-ROUNDDOWN((ROUNDDOWN(M4-tzolkinStartDate,0)+1)/13,0))*13)>0,((((ROUNDDOWN(M4-tzolkinStartDate,0)+1)/13)-ROUNDDOWN((ROUNDDOWN(M4-tzolkinStartDate,0)+1)/13,0))*13),13)))),0)+1),glyphPosition,0)),\"Manik\")","v":"Chicchan"},{"$f":"(IF(((((ROUNDDOWN(M4-tzolkinStartDate,0)+1)/13)-ROUNDDOWN((ROUNDDOWN(M4-tzolkinStartDate,0)+1)/13,0))*13)>0,((((ROUNDDOWN(M4-tzolkinStartDate,0)+1)/13)-ROUNDDOWN((ROUNDDOWN(M4-tzolkinStartDate,0)+1)/13,0))*13),13))","v":7.9999999999999716},{"$f":"INDEX(tzolkinGlyphs,MATCH(ROUND((((((M4-tzolkinStartDate)/20)-(ROUNDDOWN((M4-tzolkinStartDate)/20,0)))*20)+1),0),glyphPosition,0))","v":"Eb"},null,{"$f":"INDEX(schedule!$C:$C,MATCH(1,($M4=schedule!$A:$A)*(R$2=schedule!$B:$B),0))","v":{"$error":"#N/A"}},{"$f":"INDEX(schedule!$C:$C,MATCH(1,($M4=schedule!$A:$A)*(S$2=schedule!$B:$B),0))","v":{"$error":"#N/A"}},{"$f":"INDEX(schedule!$C:$C,MATCH(1,($M4=schedule!$A:$A)*(T$2=schedule!$B:$B),0))","v":{"$error":"#N/A"}}]
[null,"task","Study"," ",{"$f":"E4+7","v":"2020-09-15"},"2020-09-16","2020-09-17","2020-09-18","2020-09-19","2020-09-20","2020-09-21",null,"2020-09-03",{"$f":"IFERROR(INDEX(tzolkinGlyphs,MATCH((ROUND(IF(((ROUND(1+(20*(((M5-tzolkinStartDate)/20)-(ROUNDDOWN((M5-tzolkinStartDate)/20,0)))),0))-(IF(((((ROUNDDOWN(M5-tzolkinStartDate,0)+1)/13)-ROUNDDOWN((ROUNDDOWN(M5-tzolkinStartDate,0)+1)/13,0))*13)>0,((((ROUNDDOWN(M5-tzolkinStartDate,0)+1)/13)-ROUNDDOWN((ROUNDDOWN(M5-tzolkinStartDate,0)+1)/13,0))*13),13)))<0,20+((ROUND(1+(20*(((M5-tzolkinStartDate)/20)-(ROUNDDOWN((M5-tzolkinStartDate)/20,0)))),0))-(IF(((((ROUNDDOWN(M5-tzolkinStartDate,0)+1)/13)-ROUNDDOWN((ROUNDDOWN(M5-tzolkinStartDate,0)+1)/13,0))*13)>0,((((ROUNDDOWN(M5-tzolkinStartDate,0)+1)/13)-ROUNDDOWN((ROUNDDOWN(M5-tzolkinStartDate,0)+1)/13,0))*13),13))),((ROUND(1+(20*(((M5-tzolkinStartDate)/20)-(ROUNDDOWN((M5-tzolkinStartDate)/20,0)))),0))-(IF(((((ROUNDDOWN(M5-tzolkinStartDate,0)+1)/13)-ROUNDDOWN((ROUNDDOWN(M5-tzolkinStartDate,0)+1)/13,0))*13)>0,((((ROUNDDOWN(M5-tzolkinStartDate,0)+1)/13)-ROUNDDOWN((ROUNDDOWN(M5-tzolkinStartDate,0)+1)/13,0))*13),13)))),0)+1),glyphPosition,0)),\"Manik\")","v":"Chicchan"},{"$f":"(IF(((((ROUNDDOWN(M5-tzolkinStartDate,0)+1)/13)-ROUNDDOWN((ROUNDDOWN(M5-tzolkinStartDate,0)+1)/13,0))*13)>0,((((ROUNDDOWN(M5-tzolkinStartDate,0)+1)/13)-ROUNDDOWN((ROUNDDOWN(M5-tzolkinStartDate,0)+1)/13,0))*13),13))","v":9.0000000000000142},{"$f":"INDEX(tzolkinGlyphs,MATCH(ROUND((((((M5-tzolkinStartDate)/20)-(ROUNDDOWN((M5-tzolkinStartDate)/20,0)))*20)+1),0),glyphPosition,0))","v":"Ben"},null,{"$f":"INDEX(schedule!$C:$C,MATCH(1,($M5=schedule!$A:$A)*(R$2=schedule!$B:$B),0))","v":{"$error":"#N/A"}},{"$f":"INDEX(schedule!$C:$C,MATCH(1,($M5=schedule!$A:$A)*(S$2=schedule!$B:$B),0))","v":{"$error":"#N/A"}},{"$f":"INDEX(schedule!$C:$C,MATCH(1,($M5=schedule!$A:$A)*(T$2=schedule!$B:$B),0))","v":{"$error":"#N/A"}}]
[null,null,null," ",{"$f":"E5+7","v":"2020-09-22"},"2020-09-23","2020-09-24","2020-09-25","2020-09-26","2020-09-27","2020-09-28",null,"2020-09-04",{"$f":"IFERROR(INDEX(tzolkinGlyphs,MATCH((ROUND(IF(((ROUND(1+(20*(((M6-tzolkinStartDate)/20)-(ROUNDDOWN((M6-tzolkinStartDate)/20,0)))),0))-(IF(((((ROUNDDOWN(M6-tzolkinStartDate,0)+1)/13)-ROUNDDOWN((ROUNDDOWN(M6-tzolkinStartDate,0)+1)/13,0))*13)>0,((((ROUNDDOWN(M6-tzolkinStartDate,0)+1)/13)-ROUNDDOWN((ROUNDDOWN(M6-tzolkinStartDate,0)+1)/13,0))*13),13)))<0,20+((ROUND(1+(20*(((M6-tzolkinStartDate)/20)-(ROUNDDOWN((M6-tzolkinStartDate)/20,0)))),0))-(IF(((((ROUNDDOWN(M6-tzolkinStartDate,0)+1)/13)-ROUNDDOWN((ROUNDDOWN(M6-tzolkinStartDate,0)+1)/13,0))*13)>0,((((ROUNDDOWN(M6-tzolkinStartDate,0)+1)/13)-ROUNDDOWN((ROUNDDOWN(M6-tzolkinStartDate,0)+1)/13,0))*13),13))),((ROUND(1+(20*(((M6-tzolkinStartDate)/20)-(ROUNDDOWN((M6-tzolkinStartDate)/20,0)))),0))-(IF(((((ROUNDDOWN(M6-tzolkinStartDate,0)+1)/13)-ROUNDDOWN((ROUNDDOWN(M6-tzolkinStartDate,0)+1)/13,0))*13)>0,((((ROUNDDOWN(M6-tzolkinStartDate,0)+1)/13)-ROUNDDOWN((ROUNDDOWN(M6-tzolkinStartDate,0)+1)/13,0))*13),13)))),0)+1),glyphPosition,0)),\"Manik\")","v":"Chicchan"},{"$f":"(IF(((((ROUNDDOWN(M6-tzolkinStartDate,0)+1)/13)-ROUNDDOWN((ROUNDDOWN(M6-tzolkinStartDate,0)+1)/13,0))*13)>0,((((ROUNDDOWN(M6-tzolkinStartDate,0)+1)/13)-ROUNDDOWN((ROUNDDOWN(M6-tzolkinStartDate,0)+1)/13,0))*13),13))","v":9.9999999999999645},{"$f":"INDEX(tzolkinGlyphs,MATCH(ROUND((((((M6-tzolkinStartDate)/20)-(ROUNDDOWN((M6-tzolkinStartDate)/20,0)))*20)+1),0),glyphPosition,0))","v":"Ix"},null,{"$f":"INDEX(schedule!$C:$C,MATCH(1,($M6=schedule!$A:$A)*(R$2=schedule!$B:$B),0))","v":{"$error":"#N/A"}},{"$f":"INDEX(schedule!$C:$C,MATCH(1,($M6=schedule!$A:$A)*(S$2=schedule!$B:$B),0))","v":{"$error":"#N/A"}},{"$f":"INDEX(schedule!$C:$C,MATCH(1,($M6=schedule!$A:$A)*(T$2=schedule!$B:$B),0))","v":{"$error":"#N/A"}}]
[null,"notes","Today was a good day. Fill out your activity here and click the Punch button in the top left. These notes are recorded to the hours sheet."," ",{"$f":"E6+7","v":"2020-09-29"},"2020-09-30","2020-10-01","2020-10-02","2020-10-03","2020-10-04","2020-10-05",null,"2020-09-05",{"$f":"IFERROR(INDEX(tzolkinGlyphs,MATCH((ROUND(IF(((ROUND(1+(20*(((M7-tzolkinStartDate)/20)-(ROUNDDOWN((M7-tzolkinStartDate)/20,0)))),0))-(IF(((((ROUNDDOWN(M7-tzolkinStartDate,0)+1)/13)-ROUNDDOWN((ROUNDDOWN(M7-tzolkinStartDate,0)+1)/13,0))*13)>0,((((ROUNDDOWN(M7-tzolkinStartDate,0)+1)/13)-ROUNDDOWN((ROUNDDOWN(M7-tzolkinStartDate,0)+1)/13,0))*13),13)))<0,20+((ROUND(1+(20*(((M7-tzolkinStartDate)/20)-(ROUNDDOWN((M7-tzolkinStartDate)/20,0)))),0))-(IF(((((ROUNDDOWN(M7-tzolkinStartDate,0)+1)/13)-ROUNDDOWN((ROUNDDOWN(M7-tzolkinStartDate,0)+1)/13,0))*13)>0,((((ROUNDDOWN(M7-tzolkinStartDate,0)+1)/13)-ROUNDDOWN((ROUNDDOWN(M7-tzolkinStartDate,0)+1)/13,0))*13),13))),((ROUND(1+(20*(((M7-tzolkinStartDate)/20)-(ROUNDDOWN((M7-tzolkinStartDate)/20,0)))),0))-(IF(((((ROUNDDOWN(M7-tzolkinStartDate,0)+1)/13)-ROUNDDOWN((ROUNDDOWN(M7-tzolkinStartDate,0)+1)/13,0))*13)>0,((((ROUNDDOWN(M7-tzolkinStartDate,0)+1)/13)-ROUNDDOWN((ROUNDDOWN(M7-tzolkinStartDate,0)+1)/13,0))*13),13)))),0)+1),glyphPosition,0)),\"Manik\")","v":"Chicchan"},{"$f":"(IF(((((ROUNDDOWN(M7-tzolkinStartDate,0)+1)/13)-ROUNDDOWN((ROUNDDOWN(M7-tzolkinStartDate,0)+1)/13,0))*13)>0,((((ROUNDDOWN(M7-tzolkinStartDate,0)+1)/13)-ROUNDDOWN((ROUNDDOWN(M7-tzolkinStartDate,0)+1)/13,0))*13),13))","v":11.000000000000007},{"$f":"INDEX(tzolkinGlyphs,MATCH(ROUND((((((M7-tzolkinStartDate)/20)-(ROUNDDOWN((M7-tzolkinStartDate)/20,0)))*20)+1),0),glyphPosition,0))","v":"Men"},null,{"$f":"INDEX(schedule!$C:$C,MATCH(1,($M7=schedule!$A:$A)*(R$2=schedule!$B:$B),0))","v":{"$error":"#N/A"}},{"$f":"INDEX(schedule!$C:$C,MATCH(1,($M7=schedule!$A:$A)*(S$2=schedule!$B:$B),0))","v":{"$error":"#N/A"}},{"$f":"INDEX(schedule!$C:$C,MATCH(1,($M7=schedule!$A:$A)*(T$2=schedule!$B:$B),0))","v":{"$error":"#N/A"}}]
[null,null,null,null,null,null,null,null,null,null,null,null,"2020-09-06",{"$f":"IFERROR(INDEX(tzolkinGlyphs,MATCH((ROUND(IF(((ROUND(1+(20*(((M8-tzolkinStartDate)/20)-(ROUNDDOWN((M8-tzolkinStartDate)/20,0)))),0))-(IF(((((ROUNDDOWN(M8-tzolkinStartDate,0)+1)/13)-ROUNDDOWN((ROUNDDOWN(M8-tzolkinStartDate,0)+1)/13,0))*13)>0,((((ROUNDDOWN(M8-tzolkinStartDate,0)+1)/13)-ROUNDDOWN((ROUNDDOWN(M8-tzolkinStartDate,0)+1)/13,0))*13),13)))<0,20+((ROUND(1+(20*(((M8-tzolkinStartDate)/20)-(ROUNDDOWN((M8-tzolkinStartDate)/20,0)))),0))-(IF(((((ROUNDDOWN(M8-tzolkinStartDate,0)+1)/13)-ROUNDDOWN((ROUNDDOWN(M8-tzolkinStartDate,0)+1)/13,0))*13)>0,((((ROUNDDOWN(M8-tzolkinStartDate,0)+1)/13)-ROUNDDOWN((ROUNDDOWN(M8-tzolkinStartDate,0)+1)/13,0))*13),13))),((ROUND(1+(20*(((M8-tzolkinStartDate)/20)-(ROUNDDOWN((M8-tzolkinStartDate)/20,0)))),0))-(IF(((((ROUNDDOWN(M8-tzolkinStartDate,0)+1)/13)-ROUNDDOWN((ROUNDDOWN(M8-tzolkinStartDate,0)+1)/13,0))*13)>0,((((ROUNDDOWN(M8-tzolkinStartDate,0)+1)/13)-ROUNDDOWN((ROUNDDOWN(M8-tzolkinStartDate,0)+1)/13,0))*13),13)))),0)+1),glyphPosition,0)),\"Manik\")","v":"Chicchan"},{"$f":"(IF(((((ROUNDDOWN(M8-tzolkinStartDate,0)+1)/13)-ROUNDDOWN((ROUNDDOWN(M8-tzolkinStartDate,0)+1)/13,0))*13)>0,((((ROUNDDOWN(M8-tzolkinStartDate,0)+1)/13)-ROUNDDOWN((ROUNDDOWN(M8-tzolkinStartDate,0)+1)/13,0))*13),13))","v":11.999999999999957},{"$f":"INDEX(tzolkinGlyphs,MATCH(ROUND((((((M8-tzolkinStartDate)/20)-(ROUNDDOWN((M8-tzolkinStartDate)/20,0)))*20)+1),0),glyphPosition,0))","v":"Cib"},null,{"$f":"INDEX(schedule!$C:$C,MATCH(1,($M8=schedule!$A:$A)*(R$2=schedule!$B:$B),0))","v":{"$error":"#N/A"}},{"$f":"INDEX(schedule!$C:$C,MATCH(1,($M8=schedule!$A:$A)*(S$2=schedule!$B:$B),0))","v":{"$error":"#N/A"}},{"$f":"INDEX(schedule!$C:$C,MATCH(1,($M8=schedule!$A:$A)*(T$2=schedule!$B:$B),0))","v":{"$error":"#N/A"}}]
[null,null,null,null,null,"To-Do Today",null,null,null,null,null,null,"2020-09-07",{"$f":"IFERROR(INDEX(tzolkinGlyphs,MATCH((ROUND(IF(((ROUND(1+(20*(((M9-tzolkinStartDate)/20)-(ROUNDDOWN((M9-tzolkinStartDate)/20,0)))),0))-(IF(((((ROUNDDOWN(M9-tzolkinStartDate,0)+1)/13)-ROUNDDOWN((ROUNDDOWN(M9-tzolkinStartDate,0)+1)/13,0))*13)>0,((((ROUNDDOWN(M9-tzolkinStartDate,0)+1)/13)-ROUNDDOWN((ROUNDDOWN(M9-tzolkinStartDate,0)+1)/13,0))*13),13)))<0,20+((ROUND(1+(20*(((M9-tzolkinStartDate)/20)-(ROUNDDOWN((M9-tzolkinStartDate)/20,0)))),0))-(IF(((((ROUNDDOWN(M9-tzolkinStartDate,0)+1)/13)-ROUNDDOWN((ROUNDDOWN(M9-tzolkinStartDate,0)+1)/13,0))*13)>0,((((ROUNDDOWN(M9-tzolkinStartDate,0)+1)/13)-ROUNDDOWN((ROUNDDOWN(M9-tzolkinStartDate,0)+1)/13,0))*13),13))),((ROUND(1+(20*(((M9-tzolkinStartDate)/20)-(ROUNDDOWN((M9-tzolkinStartDate)/20,0)))),0))-(IF(((((ROUNDDOWN(M9-tzolkinStartDate,0)+1)/13)-ROUNDDOWN((ROUNDDOWN(M9-tzolkinStartDate,0)+1)/13,0))*13)>0,((((ROUNDDOWN(M9-tzolkinStartDate,0)+1)/13)-ROUNDDOWN((ROUNDDOWN(M9-tzolkinStartDate,0)+1)/13,0))*13),13)))),0)+1),glyphPosition,0)),\"Manik\")","v":"Chicchan"},{"$f":"(IF(((((ROUNDDOWN(M9-tzolkinStartDate,0)+1)/13)-ROUNDDOWN((ROUNDDOWN(M9-tzolkinStartDate,0)+1)/13,0))*13)>0,((((ROUNDDOWN(M9-tzolkinStartDate,0)+1)/13)-ROUNDDOWN((ROUNDDOWN(M9-tzolkinStartDate,0)+1)/13,0))*13),13))","v":13},{"$f":"INDEX(tzolkinGlyphs,MATCH(ROUND((((((M9-tzolkinStartDate)/20)-(ROUNDDOWN((M9-tzolkinStartDate)/20,0)))*20)+1),0),glyphPosition,0))","v":"Caban"},null,{"$f":"INDEX(schedule!$C:$C,MATCH(1,($M9=schedule!$A:$A)*(R$2=schedule!$B:$B),0))","v":{"$error":"#N/A"}},{"$f":"INDEX(schedule!$C:$C,MATCH(1,($M9=schedule!$A:$A)*(S$2=schedule!$B:$B),0))","v":{"$error":"#N/A"}},{"$f":"INDEX(schedule!$C:$C,MATCH(1,($M9=schedule!$A:$A)*(T$2=schedule!$B:$B),0))","v":{"$error":"#N/A"}}]
[null,null,null,null,6,null,null,null,null,null,null,null,"2020-09-08",{"$f":"IFERROR(INDEX(tzolkinGlyphs,MATCH((ROUND(IF(((ROUND(1+(20*(((M10-tzolkinStartDate)/20)-(ROUNDDOWN((M10-tzolkinStartDate)/20,0)))),0))-(IF(((((ROUNDDOWN(M10-tzolkinStartDate,0)+1)/13)-ROUNDDOWN((ROUNDDOWN(M10-tzolkinStartDate,0)+1)/13,0))*13)>0,((((ROUNDDOWN(M10-tzolkinStartDate,0)+1)/13)-ROUNDDOWN((ROUNDDOWN(M10-tzolkinStartDate,0)+1)/13,0))*13),13)))<0,20+((ROUND(1+(20*(((M10-tzolkinStartDate)/20)-(ROUNDDOWN((M10-tzolkinStartDate)/20,0)))),0))-(IF(((((ROUNDDOWN(M10-tzolkinStartDate,0)+1)/13)-ROUNDDOWN((ROUNDDOWN(M10-tzolkinStartDate,0)+1)/13,0))*13)>0,((((ROUNDDOWN(M10-tzolkinStartDate,0)+1)/13)-ROUNDDOWN((ROUNDDOWN(M10-tzolkinStartDate,0)+1)/13,0))*13),13))),((ROUND(1+(20*(((M10-tzolkinStartDate)/20)-(ROUNDDOWN((M10-tzolkinStartDate)/20,0)))),0))-(IF(((((ROUNDDOWN(M10-tzolkinStartDate,0)+1)/13)-ROUNDDOWN((ROUNDDOWN(M10-tzolkinStartDate,0)+1)/13,0))*13)>0,((((ROUNDDOWN(M10-tzolkinStartDate,0)+1)/13)-ROUNDDOWN((ROUNDDOWN(M10-tzolkinStartDate,0)+1)/13,0))*13),13)))),0)+1),glyphPosition,0)),\"Manik\")","v":"Etznab"},{"$f":"(IF(((((ROUNDDOWN(M10-tzolkinStartDate,0)+1)/13)-ROUNDDOWN((ROUNDDOWN(M10-tzolkinStartDate,0)+1)/13,0))*13)>0,((((ROUNDDOWN(M10-tzolkinStartDate,0)+1)/13)-ROUNDDOWN((ROUNDDOWN(M10-tzolkinStartDate,0)+1)/13,0))*13),13))","v":1.0000000000000426},{"$f":"INDEX(tzolkinGlyphs,MATCH(ROUND((((((M10-tzolkinStartDate)/20)-(ROUNDDOWN((M10-tzolkinStartDate)/20,0)))*20)+1),0),glyphPosition,0))","v":"Etznab"},null,{"$f":"INDEX(schedule!$C:$C,MATCH(1,($M10=schedule!$A:$A)*(R$2=schedule!$B:$B),0))","v":{"$error":"#N/A"}},{"$f":"INDEX(schedule!$C:$C,MATCH(1,($M10=schedule!$A:$A)*(S$2=schedule!$B:$B),0))","v":{"$error":"#N/A"}},{"$f":"INDEX(schedule!$C:$C,MATCH(1,($M10=schedule!$A:$A)*(T$2=schedule!$B:$B),0))","v":{"$error":"#N/A"}}]
{"$rows_left_out":25}
{"sheet":"rules","index":1,"n_rows":35,"n_cols":28,"rows_kept":35,"cut":false,"hidden":true,"merged":[]}
["rules","punchOutData"]
["date",{"$f":"NOW()","v":"2020-09-19T21:10:45.820"},null,null,null,null,"tzolkinHelper"]
[{"$f":"Control!B2","v":"io"},"in",null,null,null,null,"2019-01-06",15,"Imix",1]
[{"$f":"Control!B3","v":"name"},"Caleb Roy",null,null,null,null,null,8,"Ix",2,null,null,null,null,null,null,null,null,null,null,null,null,null,null,null,1,"manik",3]
[{"$f":"Control!B4","v":"focus"},"Personal",null,null,null,null,null,1,"Manik",3,null,null,null,null,null,null,null,null,null,null,null,null,null,null,null,2,"lamat",20]
["notes","Study"," ",null,null,null,null,14,"Ahau",4,null,null,null,null,null,null,null,null,null,null,null,null,null,null,null,3,"muluc",17]
[null,null,null,null,null,null,null,7,"Ben",5,null,null,null,null,null,null,null,null,null,null,null,null,null,null,null,4,"oc",14]
[null,"Today was a good day. Fill out your activity here and click the Punch button in the top left. These notes are recorded to the hours sheet."," ",null,null,null,null,20,"Cimi",6,null,null,null,null,null,null,null,null,null,null,null,null,null,null,null,5,"chuen",11]
[null,null,null,null,null,null,null,13,"Cauac",7,null,null,null,null,null,null,null,null,null,null,null,null,null,null,null,6,"eb",8]
[null,null,null,null,null,null,null,6,"Eb",8,null,null,null,null,null,null,null,null,null,null,null,null,null,null,null,7,"ben",5]
{"$rows_left_out":26}
{"sheet":"|","index":2,"n_rows":0,"n_cols":0,"rows_kept":0,"cut":false,"hidden":false,"merged":[]}

{"sheet":"schedule","index":3,"n_rows":4,"n_cols":3,"rows_kept":4,"cut":false,"hidden":false,"merged":[]}
["Schedule"]
["date","focus","task"]
[{"$f":"TODAY()+5","v":"2020-09-24"},"Personal","An example personal task"]
[{"$f":"TODAY()+7","v":"2020-09-26"},"Professional","Schedule appointments and dates here."]

{"sheet":"hours","index":4,"n_rows":1,"n_cols":100,"rows_kept":1,"cut":false,"hidden":false,"merged":[]}
[{"$f":"TRANSPOSE(Control!B1:B100)","v":"Date"},"io","name","focus","task",0,"notes",0,0,0,0,0,0,0,0,0,0,0,"Data","Data 2","(change me)",0,0,"Tzolkin","Wave","Tone","Glyph",0,0,0,0,0,0,0,0,0,0,0,0,0,0,0,0,0,0,0,0,0,0,0,0,0,0,0,0,0,0,0,0,0,0,0,0,0,0,0,0,0,0,0,0,0,0,0,0,0,0,0,0,0,0,0,0,0,0,0,0,0,0,0,0,0,0,0,0,0,0,0,0,0]